BDBM507163 US11046680, Example 34.0::US11046680, Example 35.0
SMILES COc1cccc(OC)c1-n1c(NS(=O)(=O)[C@@H](C)Cc2ncc(F)cn2)nnc1-c1ccn(C)c1
InChI Key InChIKey=JPALWOLOTXPWDI-AWEZNQCLSA-N
Data  2 EC50
  Tab Delimited (TSV)   2D SDfile   Computed 3D by Vconf -m prep SDfile
Find this compound or compounds like it in BindingDB:
Activity Spreadsheet -- Enzyme Inhibition Constant Data from BindingDB
Found 2 hits for monomerid = 507163
TargetApelin receptor(Homo sapiens (Human))
Amgen
US Patent
LigandPNGBDBM507163(US11046680, Example 34.0 | US11046680, Example 35....)
Affinity DataEC50:  27nM. Assay description: The human APJ receptor was cloned by polymerase chain reaction and the gene encoding the receptor was subcloned in pFLAG-CMV™-3 expression vector (Si...
Ligand InfoPC cidPC sid
In DepthDetails US Patent
TargetApelin receptor(Homo sapiens (Human))
Amgen
US Patent
LigandPNGBDBM507163(US11046680, Example 34.0 | US11046680, Example 35....)
Affinity DataEC50:  4.5nM. Assay description: The human APJ receptor was cloned by polymerase chain reaction and the gene encoding the receptor was subcloned in pFLAG-CMV™-3 expression vector (Si...
Ligand InfoPC cidPC sid
In DepthDetails US Patent