BDBM507640 3-[[4-hydroxy-1-[(3R,4R)-1-(2-methylpropanoyl)-3-phenyl-piperidine-4-carbonyl]-4-piperidyl]methyl]-7-phenyl-pyrrolo[2,3-d]pyrimidin-4-one::US11046681, Example 177
SMILES CC(C)C(=O)N1CC[C@H]([C@@H](C1)c1ccccc1)C(=O)N1CCC(O)(Cn2cnc3n(ccc3c2=O)-c2ccccc2)CC1
InChI Key InChIKey=MKVPUEAFZBZZDF-PXJZQJOASA-N
Data  1 IC50
  Tab Delimited (TSV)   2D SDfile   Computed 3D by Vconf -m prep SDfile
Find this compound or compounds like it in BindingDB:
Activity Spreadsheet -- Enzyme Inhibition Constant Data from BindingDB
Found 1 hit for monomerid = 507640
TargetUbiquitin carboxyl-terminal hydrolase 7(Homo sapiens (Human))
Les Laboratoires Servier
US Patent
LigandPNGBDBM507640(3-[[4-hydroxy-1-[(3R,4R)-1-(2-methylpropanoyl)-3-p...)
Affinity DataIC50:  103nM. Assay description: USP7 activity was measured using Rhodamine-110 c-terminal labelled Ubiquitin as a substrate (Viva Biosciences). Incubation with USP7 results in the r...
Ligand InfoPC cidPC sid
In DepthDetails US Patent