BDBM507647 US11046682, Compound 1
SMILES O=C(Nc1ccc(cc1)C#N)Nc1cccc2cncn12
InChI Key InChIKey=LGYGNDCDGRRSNT-UHFFFAOYSA-N
Data  1 IC50
  Tab Delimited (TSV)   2D SDfile   Computed 3D by Vconf -m prep SDfile
Find this compound or compounds like it in BindingDB:
Activity Spreadsheet -- Enzyme Inhibition Constant Data from BindingDB
Found 1 hit for monomerid = 507647
TargetIndoleamine 2,3-dioxygenase 1(Homo sapiens (Human))
Beijing Innocare Pharma Tech
US Patent
LigandPNGBDBM507647(US11046682, Compound 1)
Affinity DataIC50:  875nM. Assay description: The effects of the compounds of the invention on the activity of indoleamine 2,3-dioxygenase (IDO) were evaluated by the Ehrlich method.The experimen...
Ligand InfoPC cidPC sid
In DepthDetails US Patent