BDBM507690 7-(5-(5-(hydroxymethyl)-1,3,4-thiadiazol-2-yl)-4-(isopropylamino)pyridin-2-yl)pyrrolo[1,2-b]pyridazine-3-carbonitrile (Example 5)::US11046686, Example 5::US11702414, Example 5
SMILES CC(C)Nc1cc(ncc1-c1nnc(CO)s1)-c1ccc2cc(cnn12)C#N
InChI Key InChIKey=KITNHDOWRSHLFK-UHFFFAOYSA-N
Data  2 IC50
  Tab Delimited (TSV)   2D SDfile   Computed 3D by Vconf -m prep SDfile
Find this compound or compounds like it in BindingDB:
Activity Spreadsheet -- Enzyme Inhibition Constant Data from BindingDB
Found 2 hits for monomerid = 507690
TargetInterleukin-1 receptor-associated kinase 4(Homo sapiens (Human))
Gilead Sciences
US Patent
LigandPNGBDBM507690(7-(5-(5-(hydroxymethyl)-1,3,4-thiadiazol-2-yl)-4-(...)
Affinity DataIC50:  1nM. Assay description: IRAK4 enzyme (Carna Biosciences, Chuo-ku, Kobe, Japan) activity was measured by detecting phosphorylated peptide substrate formation using an antibod...
Ligand InfoPC cidPC sid
In DepthDetails US Patent
TargetInterleukin-1 receptor-associated kinase 4(Homo sapiens (Human))
Gilead Sciences
US Patent
LigandPNGBDBM507690(7-(5-(5-(hydroxymethyl)-1,3,4-thiadiazol-2-yl)-4-(...)
Affinity DataIC50:  1nM. Assay description: IRAK4 enzyme (Carna Biosciences, Chuo-ku, Kobe, Japan) activity was measured by detecting phosphorylated peptide substrate formation using an antibod...
Ligand InfoPC cidPC sid
In DepthDetails US Patent