BDBM507980 4-amino-7-chloro-1-(2-chlorophenyl)- hydroquinazolin-2-one::US11046691, Compound 148::US11084798, Cpd No 148::US11130759, Cpd. No. 148
SMILES Nc1nc(=O)n(-c2ccccc2Cl)c2cc(Cl)ccc12
InChI Key InChIKey=JMVVXEDIDTXUGG-UHFFFAOYSA-N
Data  3 IC50
  Tab Delimited (TSV)   2D SDfile   Computed 3D by Vconf -m prep SDfile
Find this compound or compounds like it in BindingDB:
Activity Spreadsheet -- Enzyme Inhibition Constant Data from BindingDB
Found 3 hits for monomerid = 507980
TargetS-adenosylmethionine synthase isoform type-2(Human)
Ideaya Biosciences
US Patent
LigandPNGBDBM507980(4-amino-7-chloro-1-(2-chlorophenyl)- hydroquinazol...)
Affinity DataIC50: <200nM. Assay description: MAT2A enzyme is incubated with a test compound in DMSO or DMSO and its substrates (L-methionine and ATP) in a microtiter plate. The enzymatic reactio...
Ligand InfoPC cidPC sid
In DepthDetails US Patent
TargetS-adenosylmethionine synthase isoform type-2(Human)
Ideaya Biosciences
US Patent
LigandPNGBDBM507980(4-amino-7-chloro-1-(2-chlorophenyl)- hydroquinazol...)
Affinity DataIC50: <200nM. Assay description: Enzyme: MAT2AhMAT2A: 50 nM, Cepter, 10 mg/mL (234 μM), amino acids 1-395Substrates: 500 uM eachReaction time: 1 hourL-methionine Substrate: Alfa...
Ligand InfoPC cidPC sid
In DepthDetails US Patent
TargetS-adenosylmethionine synthase isoform type-2(Human)
Ideaya Biosciences
US Patent
LigandPNGBDBM507980(4-amino-7-chloro-1-(2-chlorophenyl)- hydroquinazol...)
Affinity DataIC50: <200nM. Assay description: For the assay, a mixture of 1 mM L-methionine/1 mM ATP (2× final pre-stopped concentration) in assay buffer; MAT2A (2× final pre-stopped concentratio...
Ligand InfoPC cidPC sid
In DepthDetails US Patent