BDBM508596 4-[2-(5-amino-2,2-difluoro[1,3] dioxolo[4,5-h][1,2,4]triazolo [1,5-c]quinazolin-8-yl)ethyl]-1- cyclopentylpiperazin-2-one::US11046714, Example 49
SMILES Nc1nc2c3OC(F)(F)Oc3ccc2c2nc(CCN3CCN(C4CCCC4)C(=O)C3)nn12
InChI Key InChIKey=GCRWICJKQIDBHQ-UHFFFAOYSA-N
Data  1 KI
  Tab Delimited (TSV)   2D SDfile   Computed 3D by Vconf -m prep SDfile
Find this compound or compounds like it in BindingDB:
Activity Spreadsheet -- Enzyme Inhibition Constant Data from BindingDB
Found 1 hit for monomerid = 508596
TargetAdenosine receptor A2a(Homo sapiens (Human))
Merck Sharp & Dohme
US Patent
LigandPNGBDBM508596(4-[2-(5-amino-2,2-difluoro[1,3] dioxolo[4,5-h][1,2...)
Affinity DataKi:  1.60nM. Assay description: The following table shows representative data for the compounds of the Examples as A2a receptor antagonists as determined by a competition binding as...
Ligand InfoPC cidPC sid
In DepthDetails US Patent