BDBM508616 8-(2-{(cyclopropylmethyl)[(2- methyl-1,3-thiazol-5- yl)methyl]amino}ethyl)-2,2- difluoro[1,3]dioxolo[4,5- h][1,2,4]triazolo[1,5- c]quinazolin-5-amine::US11046714, Example 61
SMILES Cc1ncc(CN(CCc2nc3c4ccc5OC(F)(F)Oc5c4nc(N)n3n2)CC2CC2)s1
InChI Key InChIKey=VHAZWQIFHRSADS-UHFFFAOYSA-N
Data  1 KI
  Tab Delimited (TSV)   2D SDfile   Computed 3D by Vconf -m prep SDfile
Find this compound or compounds like it in BindingDB:
Activity Spreadsheet -- Enzyme Inhibition Constant Data from BindingDB
Found 1 hit for monomerid = 508616
TargetAdenosine receptor A2a(Homo sapiens (Human))
Merck Sharp & Dohme
US Patent
LigandPNGBDBM508616(8-(2-{(cyclopropylmethyl)[(2- methyl-1,3-thiazol-5...)
Affinity DataKi:  1.5nM. Assay description: The following table shows representative data for the compounds of the Examples as A2a receptor antagonists as determined by a competition binding as...
Ligand InfoPC cidPC sid
In DepthDetails US Patent