BDBM508672 US11046714, Example 109
SMILES Nc1nc2c3OC(F)(F)Oc3ccc2c2nc(CN3CC(F)(F)C3)nn12
InChI Key InChIKey=FAKUNPHJEUQGES-UHFFFAOYSA-N
Data  1 KI
  Tab Delimited (TSV)   2D SDfile   Computed 3D by Vconf -m prep SDfile
Find this compound or compounds like it in BindingDB:
Activity Spreadsheet -- Enzyme Inhibition Constant Data from BindingDB
Found 1 hit for monomerid = 508672
TargetAdenosine receptor A2a(Homo sapiens (Human))
Merck Sharp & Dohme
US Patent
LigandPNGBDBM508672(US11046714, Example 109)
Affinity DataKi:  5.90nM. Assay description: The following table shows representative data for the compounds of the Examples as A2a receptor antagonists as determined by a competition binding as...
Ligand InfoPC cidPC sid
In DepthDetails US Patent