BDBM508719 2,2-difluoro-8-[(1-pyridin-2- ylazetidin-3-yl)methyl][1,3] dioxolo[4,5-h][1,2,4]triazolo [1,5-c]quinazolin-5-amine::US11046714, Example 153
SMILES Nc1nc2c3OC(F)(F)Oc3ccc2c2nc(CC3CN(C3)c3ccccn3)nn12
InChI Key InChIKey=ODKYMKFAWHGQEK-UHFFFAOYSA-N
Data  1 KI
  Tab Delimited (TSV)   2D SDfile   Computed 3D by Vconf -m prep SDfile
Find this compound or compounds like it in BindingDB:
Activity Spreadsheet -- Enzyme Inhibition Constant Data from BindingDB
Found 1 hit for monomerid = 508719
TargetAdenosine receptor A2a(Homo sapiens (Human))
Merck Sharp & Dohme
US Patent
LigandPNGBDBM508719(2,2-difluoro-8-[(1-pyridin-2- ylazetidin-3-yl)meth...)
Affinity DataKi:  170nM. Assay description: The following table shows representative data for the compounds of the Examples as A2a receptor antagonists as determined by a competition binding as...
Ligand InfoPC cidPC sid
In DepthDetails US Patent