BDBM509 Cancer Chemotherapy National Service Center (CCNSC) compound 40328::NSC 40328::phenyl N-(2-hydroxy-1,2-diphenylethyl)-N-(2-hydroxyethyl)carbamate
SMILES OCCN(C(C(O)c1ccccc1)c1ccccc1)C(=O)Oc1ccccc1
InChI Key InChIKey=SZCAVXACQFEDQN-UHFFFAOYSA-N
Data  1 IC50
  Tab Delimited (TSV)   2D SDfile   Computed 3D by Vconf -m prep SDfile
Find this compound or compounds like it in BindingDB:
Activity Spreadsheet -- Enzyme Inhibition Constant Data from BindingDB
Found 1 hit for monomerid = 509
TargetDimer of Gag-Pol polyprotein [489-587](Human immunodeficiency virus type 1)
National Institutes Of Health
LigandPNGBDBM509(Cancer Chemotherapy National Service Center (CCNSC...)
Affinity DataIC50:  3.20E+4nMpH: 6.5 T: 2°C. Assay description: Sensitivity of HIV-1 protease activity to protease inhibitors was determined by a peptide substrate cleavage assay. Protease products were analyzed o...
Ligand InfoPC cidPC sid
In DepthDetails ArticlePubMed