BDBM50951 MLS000326921::N'-(3-chlorobenzoyl)-3-(1H-pyrrol-1-yl)-2-thiophenecarbohydrazide::N'-(3-chlorobenzoyl)-3-pyrrol-1-yl-thiophene-2-carbohydrazide::N'-(3-chlorobenzoyl)-3-pyrrol-1-ylthiophene-2-carbohydrazide::N'-(3-chlorophenyl)carbonyl-3-pyrrol-1-yl-thiophene-2-carbohydrazide::N'-[(3-chlorophenyl)-oxomethyl]-3-(1-pyrrolyl)-2-thiophenecarbohydrazide::SMR000179448::cid_3775493
SMILES Clc1cccc(c1)C(=O)NNC(=O)c1sccc1-n1cccc1
InChI Key InChIKey=YZBIMYUELKRUBC-UHFFFAOYSA-N
Data  1 IC50
  Tab Delimited (TSV)   2D SDfile   Computed 3D by Vconf -m prep SDfile
Find this compound or compounds like it in BindingDB:
Activity Spreadsheet -- Enzyme Inhibition Constant Data from BindingDB
Found 1 hit for monomerid = 50951
TargetGlycoprotein 42(Human herpesvirus 4 type 2)
Emory University
Curated by PubChem BioAssay
LigandPNGBDBM50951(MLS000326921 | N'-(3-chlorobenzoyl)-3-(1H-pyrr...)
Affinity DataIC50:  5.09E+3nM. Assay description: NIH Molecular Libraries Screening Centers Network [MLSCN] Emory Chemical Biology Discovery Center in MLSCN Assay provider: Theodore Jardetzky; Northw...
In DepthDetails PCBioAssay