BDBM509818 US11124497, Compound 265::US11312704, Compound 265::US11472793, Compound 265::US11524940, Compound 265
SMILES O=C(N[C@@H](C[C@@H]1CCNC1=O)C#N)[C@H](CC1CC1)n1ccc2cc[nH]c2c1=O
InChI Key
Data  7 IC50
  Tab Delimited (TSV)   2D SDfile   Computed 3D by Vconf -m prep SDfile
Find this compound or compounds like it in BindingDB:
Activity Spreadsheet -- Enzyme Inhibition Constant Data from BindingDB
Found 7 hits for monomerid = 509818
TargetReplicase polyprotein 1ab(HCoV-229E)
Pardes Biosciences
US Patent
LigandPNGBDBM509818(US11124497, Compound 265 | US11312704, Compound 26...)
Affinity DataIC50:  6.00E+3nM. Assay description: Compounds were assayed using standard methods to assess compound activity and IC50. As an exemplary for assessment of the SARS-COV2 Mpro, the C-His6-...
Ligand InfoPC cidPC sid
In DepthDetails US Patent
TargetReplicase polyprotein 1ab(2019-nCoV)
Pardes Biosciences
US Patent
LigandPNGBDBM509818(US11124497, Compound 265 | US11312704, Compound 26...)
Affinity DataIC50:  6.00E+3nM. Assay description: Compounds were assayed using standard methods to assess compound activity and IC50. As an exemplary for assessment of the SARS-COV2 Mpro, the C-His6-...
Ligand InfoPC cidPC sid
In DepthDetails US Patent
TargetReplicase polyprotein 1ab(HCoV-229E)
Pardes Biosciences
US Patent
LigandPNGBDBM509818(US11124497, Compound 265 | US11312704, Compound 26...)
Affinity DataIC50:  6.00E+3nM. Assay description: Compounds were assayed using standard methods against multiple coronaviral strains, including HCoV 229E and OC43 strains. The antiviral activity of c...
Ligand InfoPC cidPC sid
In DepthDetails US Patent
TargetReplicase polyprotein 1ab(2019-nCoV)
Pardes Biosciences
US Patent
LigandPNGBDBM509818(US11124497, Compound 265 | US11312704, Compound 26...)
Affinity DataIC50:  6.00E+3nM. Assay description: Compounds were assayed using standard methods to assess compound activity and IC50. As an exemplary for assessment of the SARS-COV2 Mpro, the C-His6-...
Ligand InfoPC cidPC sid
In DepthDetails US Patent
TargetReplicase polyprotein 1a(Human SARS coronavirus (SARS-CoV))
Pardes Biosciences
US Patent
LigandPNGBDBM509818(US11124497, Compound 265 | US11312704, Compound 26...)
Affinity DataIC50:  6.00E+3nM. Assay description: Compounds are assayed using standard methods to assess compound activity and IC50. As an exemplary for assessment of the SARS-COV2 Mpro, the C-His6-t...
Ligand InfoPC cidPC sid
In DepthDetails US Patent
TargetReplicase polyprotein 1ab(HCoV-229E)
Pardes Biosciences
US Patent
LigandPNGBDBM509818(US11124497, Compound 265 | US11312704, Compound 26...)
Affinity DataIC50:  6.00E+3nM. Assay description: Compounds were assayed using standard methods against multiple coronaviral strains, including HCoV 229E and OC43 strains. The antiviral activity of c...
Ligand InfoPC cidPC sid
In DepthDetails US Patent
TargetReplicase polyprotein 1ab(2019-nCoV)
Pardes Biosciences
US Patent
LigandPNGBDBM509818(US11124497, Compound 265 | US11312704, Compound 26...)
Affinity DataIC50:  6.00E+3nM. Assay description: Compounds were assayed using standard methods to assess compound activity and IC50. As an exemplary for assessment of the SARS-COV2 Mpro, the C-His6-...
Ligand InfoPC cidPC sid
In DepthDetails US Patent