BDBM509879 US11124497, Compound 451 (Isomer 2)::US11312704, Compound 451 Isomer 2::US11472793, Compound 451 (Isomer 1)::US11524940, Compound 451 (Isomer 2)
SMILES Cc1ccn([C@H](CC2CC2)C(=O)N[C@@H](C[C@@H]2CCNC2=O)C#N)c(=O)c1NCC(F)(F)F
InChI Key InChIKey=SYZOFRXZMALRGI-HRCADAONSA-N
Data  7 IC50
  Tab Delimited (TSV)   2D SDfile   Computed 3D by Vconf -m prep SDfile
Find this compound or compounds like it in BindingDB:
Activity Spreadsheet -- Enzyme Inhibition Constant Data from BindingDB
Found 7 hits for monomerid = 509879
TargetReplicase polyprotein 1ab(HCoV-229E)
Pardes Biosciences
US Patent
LigandPNGBDBM509879(US11124497, Compound 451 (Isomer 2) | US11312704, ...)
Affinity DataIC50:  2.00E+4nM. Assay description: Compounds were assayed using standard methods to assess compound activity and IC50. As an exemplary for assessment of the SARS-COV2 Mpro, the C-His6-...
Ligand InfoPC cidPC sid
In DepthDetails US Patent
TargetReplicase polyprotein 1ab(2019-nCoV)
Pardes Biosciences
US Patent
LigandPNGBDBM509879(US11124497, Compound 451 (Isomer 2) | US11312704, ...)
Affinity DataIC50:  6.00E+3nM. Assay description: Compounds were assayed using standard methods to assess compound activity and IC50. As an exemplary for assessment of the SARS-COV2 Mpro, the C-His6-...
Ligand InfoPC cidPC sid
In DepthDetails US Patent
TargetReplicase polyprotein 1ab(HCoV-229E)
Pardes Biosciences
US Patent
LigandPNGBDBM509879(US11124497, Compound 451 (Isomer 2) | US11312704, ...)
Affinity DataIC50: >3.00E+4nM. Assay description: Compounds were assayed using standard methods against multiple coronaviral strains, including HCoV 229E and OC43 strains. The antiviral activity of c...
Ligand InfoPC cidPC sid
In DepthDetails US Patent
TargetReplicase polyprotein 1ab(2019-nCoV)
Pardes Biosciences
US Patent
LigandPNGBDBM509879(US11124497, Compound 451 (Isomer 2) | US11312704, ...)
Affinity DataIC50:  6.00E+3nM. Assay description: Compounds were assayed using standard methods to assess compound activity and IC50. As an exemplary for assessment of the SARS-COV2 Mpro, the C-His6-...
Ligand InfoPC cidPC sid
In DepthDetails US Patent
TargetReplicase polyprotein 1a(Human SARS coronavirus (SARS-CoV))
Pardes Biosciences
US Patent
LigandPNGBDBM509879(US11124497, Compound 451 (Isomer 2) | US11312704, ...)
Affinity DataIC50:  6.00E+3nM. Assay description: Compounds are assayed using standard methods to assess compound activity and IC50. As an exemplary for assessment of the SARS-COV2 Mpro, the C-His6-t...
Ligand InfoPC cidPC sid
In DepthDetails US Patent
TargetReplicase polyprotein 1ab(HCoV-229E)
Pardes Biosciences
US Patent
LigandPNGBDBM509879(US11124497, Compound 451 (Isomer 2) | US11312704, ...)
Affinity DataIC50:  2.00E+4nM. Assay description: Compounds were assayed using standard methods against multiple coronaviral strains, including HCoV 229E and OC43 strains. The antiviral activity of c...
Ligand InfoPC cidPC sid
In DepthDetails US Patent
TargetReplicase polyprotein 1ab(2019-nCoV)
Pardes Biosciences
US Patent
LigandPNGBDBM509879(US11124497, Compound 451 (Isomer 2) | US11312704, ...)
Affinity DataIC50: >3.00E+4nM. Assay description: Compounds were assayed using standard methods to assess compound activity and IC50. As an exemplary for assessment of the SARS-COV2 Mpro, the C-His6-...
Ligand InfoPC cidPC sid
In DepthDetails US Patent