BDBM509973 Advanced SARS-CoV-2 Inhibitor 6j::acs.jmedchem.1c00409_ST.190
SMILES CC(C)C[C@H](NC(=O)OCC1CCC(F)(F)CC1)C(=O)N[C@@H](C[C@@H]1CCNC1=O)C=O
InChI Key InChIKey=COXVPYKZDDKVRF-ULQDDVLXSA-N
Data  4 IC50  1 EC50
  Tab Delimited (TSV)   2D SDfile   Computed 3D by Vconf -m prep SDfile
Find this compound or compounds like it in BindingDB:
Activity Spreadsheet -- Enzyme Inhibition Constant Data from BindingDB
Found 5 hits for monomerid = 509973
TargetReplicase polyprotein 1ab(2019-nCoV)
Michigan State University
LigandPNGBDBM509973(Advanced SARS-CoV-2 Inhibitor 6j | acs.jmedchem.1c...)
Affinity DataEC50:  800nM. Assay description: This is a review article. Please point to the original journal.
Ligand InfoPC cidPC sid
In DepthDetails ArticlePubMed
TargetReplicase polyprotein 1ab(Human SARS coronavirus (SARS-CoV) (Severe acute re...)
Michigan State University
LigandPNGBDBM509973(Advanced SARS-CoV-2 Inhibitor 6j | acs.jmedchem.1c...)
Affinity DataIC50:  1.20E+3nM. Assay description: This is a review article. Please point to the original journal.
Ligand InfoPC cidPC sid
In DepthDetails ArticlePubMed
TargetCathepsin B(Homo sapiens (Human))
The University Of Arizona
LigandPNGBDBM509973(Advanced SARS-CoV-2 Inhibitor 6j | acs.jmedchem.1c...)
Affinity DataIC50: <0.5nM. Assay description: FRET-based enzymatic assay.
Ligand InfoPC cidPC sid
In DepthDetails ArticlePubMed
TargetReplicase polyprotein 1ab(2019-nCoV)
Michigan State University
LigandPNGBDBM509973(Advanced SARS-CoV-2 Inhibitor 6j | acs.jmedchem.1c...)
Affinity DataIC50:  7nM. Assay description: FRET-based enzymatic assay.
Ligand InfoPC cidPC sid
In DepthDetails ArticlePubMed
TargetReplicase polyprotein 1ab(2019-nCoV)
Michigan State University
LigandPNGBDBM509973(Advanced SARS-CoV-2 Inhibitor 6j | acs.jmedchem.1c...)
Affinity DataIC50:  480nM. Assay description: This is a review article. Please point to the original journal.
Ligand InfoPC cidPC sid
In DepthDetails ArticlePubMed