BDBM509975 Jun9-61-1
SMILES C[C@H](NC(=O)C(N(C(=O)CN=[N+]=[N-])c1ccc(cc1)-c1ccccc1)c1cccnc1)c1ccccc1
InChI Key InChIKey=GEYTVBNZOHWYQI-QDLLFRBVSA-N
Data  1 IC50
  Tab Delimited (TSV)   2D SDfile   Computed 3D by Vconf -m prep SDfile
Find this compound or compounds like it in BindingDB:
Activity Spreadsheet -- Enzyme Inhibition Constant Data from BindingDB
Found 1 hit for monomerid = 509975
TargetReplicase polyprotein 1ab(2019-nCoV)
The University Of Arizona
LigandPNGBDBM509975(Jun9-61-1)
Affinity DataIC50: >2.00E+4nM. Assay description: FRET-based enzymatic assay.
Ligand InfoPC cidPC sid
In DepthDetails ArticlePubMed