BDBM509985 Jun9-57-2
SMILES ClCC(=O)N(C(C(=O)NC1CC1)c1cccnc1)c1ccc(cc1)-c1ccccc1
InChI Key InChIKey=DISJOFYDDCHFJN-UHFFFAOYSA-N
Data  1 IC50
  Tab Delimited (TSV)   2D SDfile   Computed 3D by Vconf -m prep SDfile
Find this compound or compounds like it in BindingDB:
Activity Spreadsheet -- Enzyme Inhibition Constant Data from BindingDB
Found 1 hit for monomerid = 509985
TargetReplicase polyprotein 1ab(2019-nCoV)
The University Of Arizona
LigandPNGBDBM509985(Jun9-57-2)
Affinity DataIC50:  220nM. Assay description: FRET-based enzymatic assay.
Ligand InfoPC cidPC sid
In DepthDetails ArticlePubMed