BDBM510105 US11351149, Example 57::WO2021250648, Example 57
SMILES CC(C)(C)C[C@H](NC(=O)c1cc2cccc(c2[nH]1)C(F)(F)F)C(=O)N[C@@H](C[C@@H]1CCNC1=O)C#N
InChI Key InChIKey=CZFNHMDDLQKLAQ-MPGHIAIKSA-N
Data  1 KI  1 IC50
  Tab Delimited (TSV)   2D SDfile   Computed 3D by Vconf -m prep SDfile
Find this compound or compounds like it in BindingDB:
Activity Spreadsheet -- Enzyme Inhibition Constant Data from BindingDB
Found 2 hits for monomerid = 510105
TargetReplicase polyprotein 1a(2019-nCoV)
Pfizer
US Patent
LigandPNGBDBM510105(US11351149, Example 57 | WO2021250648, Example 57)
Affinity DataKi:  52nM. Assay description: The proteolytic activity of the main protease, 3CLpro, of SARS-CoV-2 was monitored using a continuous fluorescence resonance energy transfer (FRET) a...
Ligand InfoPC cidPC sid
In DepthDetails US Patent
TargetReplicase polyprotein 1ab(2019-nCoV)
Pfizer
WIPO
LigandPNGBDBM510105(US11351149, Example 57 | WO2021250648, Example 57)
Affinity DataIC50:  52nM. Assay description: The proteolytic activity of the main protease, 3CLpro, of SARS-CoV-2 was monitored using a continuous fluorescence resonance energy transfer (FRET) a...
Ligand InfoPC cidPC sid
In DepthDetails PubMed