BDBM512454 acs.jmedchem.1c00409_ST.47
SMILES CC(C)C[C@@H](NC(=O)[C@H](NC(=O)OCc1ccccc1)C(C)C)C(=O)N[C@H](C[C@H]1CCNC1=O)C(=O)c1ncc(s1)-c1ccccc1
InChI Key InChIKey=PJDLIABGYBCSQU-LTGLEFCMSA-N
Data  1 KI
  Tab Delimited (TSV)   2D SDfile   Computed 3D by Vconf -m prep SDfile
Find this compound or compounds like it in BindingDB:
Activity Spreadsheet -- Enzyme Inhibition Constant Data from BindingDB
Found 1 hit for monomerid = 512454
TargetReplicase polyprotein 1ab(Human SARS coronavirus (SARS-CoV) (Severe acute re...)
Michigan State University
LigandPNGBDBM512454(acs.jmedchem.1c00409_ST.47)
Affinity DataKi:  60nM. Assay description: This is a review article. Please point to the original journal.
Ligand InfoPC cidPC sid
In DepthDetails ArticlePubMed