BDBM512534 WO2021219089, INSCoV-503C
SMILES Cc1ccc(CCN(C(C(=O)NC2CCCCC2)c2cccnc2)C(=O)CCl)cc1
InChI Key InChIKey=UWLBNZNGSRPOPG-UHFFFAOYSA-N
Data  1 IC50
  Tab Delimited (TSV)   2D SDfile   Computed 3D by Vconf -m prep SDfile
Find this compound or compounds like it in BindingDB:
Activity Spreadsheet -- Enzyme Inhibition Constant Data from BindingDB
Found 1 hit for monomerid = 512534
TargetReplicase polyprotein 1ab(2019-nCoV)
Insilico Medicine Ip
WIPO
LigandPNGBDBM512534(WO2021219089, INSCoV-503C)
Affinity DataIC50:  1.38E+3nM. Assay description: he C-His6-tagged SARS-CoV-2 M PRO (NC_045512) was cloned, expressed in E. coli and purified by WuXi. The substrate of Dabcyl-KTSAVLQ‖SGFRKME- (...
Ligand InfoPC cidPC sid
In DepthDetails PubMed