BDBM512555 acs.jmedchem.1c00409_ST.148
SMILES ClCC(=O)[C@H](Cc1ccc2ccccc2c1)NC(=O)OCc1ccccc1
InChI Key InChIKey=BMGGQIBPEMUTCE-FQEVSTJZSA-N
Data  1 KI
  Tab Delimited (TSV)   2D SDfile   Computed 3D by Vconf -m prep SDfile
Find this compound or compounds like it in BindingDB:
Activity Spreadsheet -- Enzyme Inhibition Constant Data from BindingDB
Found 1 hit for monomerid = 512555
TargetReplicase polyprotein 1ab(Human SARS coronavirus (SARS-CoV) (Severe acute re...)
Michigan State University
LigandPNGBDBM512555(acs.jmedchem.1c00409_ST.148)
Affinity DataKi:  370nM. Assay description: This is a review article. Please point to the original journal.
Ligand InfoPC cidPC sid
In DepthDetails ArticlePubMed