BDBM512603 WO2021219089, INSCoV-535
SMILES CC(C)(C)c1ccc(cc1)N(C(C(=O)NC1CCCCC1)c1cncc(O)c1)C(=O)CCl
InChI Key InChIKey=LRGYRDSGTLGJJZ-UHFFFAOYSA-N
Data  1 IC50
  Tab Delimited (TSV)   2D SDfile   Computed 3D by Vconf -m prep SDfile
Find this compound or compounds like it in BindingDB:
Activity Spreadsheet -- Enzyme Inhibition Constant Data from BindingDB
Found 1 hit for monomerid = 512603
TargetReplicase polyprotein 1ab(2019-nCoV)
Insilico Medicine Ip
WIPO
LigandPNGBDBM512603(WO2021219089, INSCoV-535)
Affinity DataIC50:  1.04E+3nM. Assay description: he C-His6-tagged SARS-CoV-2 M PRO (NC_045512) was cloned, expressed in E. coli and purified by WuXi. The substrate of Dabcyl-KTSAVLQ‖SGFRKME- (...
Ligand InfoPC cidPC sid
In DepthDetails PubMed