BDBM512672 acs.jmedchem.1c00409_ST.266
SMILES CC(C)C[C@@H](NC(=O)[C@H](NC(=O)CNc1ccccc1)C(C)C)C(=O)N[C@H](C[C@H]1CCNC1=O)C(=O)c1nc2ccccc2s1
InChI Key InChIKey=PPHLPUPOOAKMQM-VGSCBBJJSA-N
Data  1 KI  1 IC50
  Tab Delimited (TSV)   2D SDfile   Computed 3D by Vconf -m prep SDfile
Find this compound or compounds like it in BindingDB:
Activity Spreadsheet -- Enzyme Inhibition Constant Data from BindingDB
Found 2 hits for monomerid = 512672
TargetReplicase polyprotein 1ab(Human SARS coronavirus (SARS-CoV) (Severe acute re...)
Michigan State University
LigandPNGBDBM512672(acs.jmedchem.1c00409_ST.266)
Affinity DataKi:  220nM. Assay description: This is a review article. Please point to the original journal.
Ligand InfoPC cidPC sid
In DepthDetails ArticlePubMed
TargetReplicase polyprotein 1ab(Human SARS coronavirus (SARS-CoV) (Severe acute re...)
Michigan State University
LigandPNGBDBM512672(acs.jmedchem.1c00409_ST.266)
Affinity DataIC50:  1.50E+3nM. Assay description: This is a review article. Please point to the original journal.
Ligand InfoPC cidPC sid
In DepthDetails ArticlePubMed