BDBM512878 WO2021219089, INSCoV-601Q (1B)
SMILES ClCC(=O)N([C@H](C(=O)N[C@H]1CCOC1)c1cnccn1)c1ccc(cc1)-c1ccno1
InChI Key InChIKey=ZLJHYRUZYANNEU-YWZLYKJASA-N
Data  1 IC50
  Tab Delimited (TSV)   2D SDfile   Computed 3D by Vconf -m prep SDfile
Find this compound or compounds like it in BindingDB:
Activity Spreadsheet -- Enzyme Inhibition Constant Data from BindingDB
Found 1 hit for monomerid = 512878
TargetReplicase polyprotein 1ab(2019-nCoV)
Insilico Medicine Ip
WIPO
LigandPNGBDBM512878(WO2021219089, INSCoV-601Q (1B))
Affinity DataIC50:  71nM. Assay description: he C-His6-tagged SARS-CoV-2 M PRO (NC_045512) was cloned, expressed in E. coli and purified by WuXi. The substrate of Dabcyl-KTSAVLQ‖SGFRKME- (...
Ligand InfoPC cidPC sid
In DepthDetails PubMed