BDBM51744 6-(4-Ethyl-phenyl)-2-phenyl-imidazo[1,2-b][1,2,4]triazine::6-(4-ethylphenyl)-2-phenyl-imidazo[1,2-b][1,2,4]triazine::6-(4-ethylphenyl)-2-phenylimidazo[1,2-b][1,2,4]triazine::MLS001049368::SMR000427357::cid_627189
SMILES CCc1ccc(cc1)-c1cn2nc(cnc2n1)-c1ccccc1
InChI Key InChIKey=KDDRHXQVNUBFHT-UHFFFAOYSA-N
Data  1 IC50
  Tab Delimited (TSV)   2D SDfile   Computed 3D by Vconf -m prep SDfile
Find this compound or compounds like it in BindingDB:
Activity Spreadsheet -- Enzyme Inhibition Constant Data from BindingDB
Found 1 hit for monomerid = 51744
TargetdTDP-4-dehydrorhamnose 3,5-epimerase(Mycobacterium tuberculosis H37Rv)
Pcmd
Curated by PubChem BioAssay
LigandPNGBDBM51744(6-(4-Ethyl-phenyl)-2-phenyl-imidazo[1,2-b][1,2,4]t...)
Affinity DataIC50:  3.53E+4nM. Assay description: Molecular Library Screening Center Network (MLSCN) Penn Center for Molecular Discovery (PCMD) Assay Provider: Michael McNeil, Colorado State Universi...
In DepthDetails PCBioAssay