BDBM519667 US11142525, Example 68
SMILES C[C@@H]1CCCN1c1cc2C(=O)N(Cc2c(CN)n1)c1cccc(n1)N1[C@@H](CF)COC1=O
InChI Key InChIKey=KYTNFFDNEOBENA-KGLIPLIRSA-N
Data  1 KI
  Tab Delimited (TSV)   2D SDfile   Computed 3D by Vconf -m prep SDfile
Find this compound or compounds like it in BindingDB:
Activity Spreadsheet -- Enzyme Inhibition Constant Data from BindingDB
Found 1 hit for monomerid = 519667
TargetMitogen-activated protein kinase kinase kinase kinase 1(Homo sapiens (Human))
Pfizer
US Patent
LigandPNGBDBM519667(US11142525, Example 68)
Affinity DataKi: <0.0700nM. Assay description: HPK1 enzyme inhibition was measured using a microfluidic mobility shift assay (MSA). The reactions were conducted in 50 μL volumes in 96-well pl...
Ligand InfoPC cidPC sid
In DepthDetails US Patent