BDBM525171 Benzyl N-[(1S)-1-[[(2-chloroacetyl)-propyl-amino]carbamoyl]-3-methyl-butyl]carbamate::WO2022043374, Example 21
SMILES CCCN(NC(=O)[C@H](CC(C)C)NC(=O)OCc1ccccc1)C(=O)CCl
InChI Key InChIKey=ZUUZJOZGSVOWKD-INIZCTEOSA-N
Data  1 IC50
  Tab Delimited (TSV)   2D SDfile   Computed 3D by Vconf -m prep SDfile
Find this compound or compounds like it in BindingDB:
Activity Spreadsheet -- Enzyme Inhibition Constant Data from BindingDB
Found 1 hit for monomerid = 525171
TargetReplicase polyprotein 1ab(2019-nCoV)
F. Hoffmann-La Roche
WIPO
LigandPNGBDBM525171(Benzyl N-[(1S)-1-[[(2-chloroacetyl)-propyl-amino]c...)
Affinity DataIC50:  390nM. Assay description: For the SARS-CoV-2 3CLpro assay, 2 μL of 0.02 μM recombinant SARS-CoV-2 3CL protease were mixed with serial dilutions of each c...
Ligand InfoPC cidPC sid
In DepthDetails PubMed