BDBM525190 N-[(1S)-1-[[(3-Amino-3-oxo-propyl)-(2-chloroacetyl)amino]carbamoyl]-3-methyl-butyl]-N-methyl-1H-indole-2-carboxamide::WO2022043374, Example 40
SMILES CC(C)C[C@H](N(C)C(=O)c1cc2ccccc2[nH]1)C(=O)NN(CCC(N)=O)C(=O)CCl
InChI Key InChIKey=HPVZFPSUGDSXRL-KRWDZBQOSA-N
Data  1 IC50
  Tab Delimited (TSV)   2D SDfile   Computed 3D by Vconf -m prep SDfile
Find this compound or compounds like it in BindingDB:
Activity Spreadsheet -- Enzyme Inhibition Constant Data from BindingDB
Found 1 hit for monomerid = 525190
TargetReplicase polyprotein 1ab(2019-nCoV)
F. Hoffmann-La Roche
WIPO
LigandPNGBDBM525190(N-[(1S)-1-[[(3-Amino-3-oxo-propyl)-(2-chloroacetyl...)
Affinity DataIC50:  7nM. Assay description: For the SARS-CoV-2 3CLpro assay, 2 μL of 0.02 μM recombinant SARS-CoV-2 3CL protease were mixed with serial dilutions of each c...
Ligand InfoPC cidPC sid
In DepthDetails PubMed