BDBM525198 N-[(1S)-1-[[(3-Amino-3-oxo-propyl)-(2-chloroacetyl)amino]carbamoyl]-3-methyl-butyl]-5-methoxy-6H-pyrrolo[2,3-c]pyridine-2-carboxamide::WO2022043374, Example 47
SMILES COc1cc2cc(nc2c[nH]1)C(=O)N[C@@H](CC(C)C)C(=O)NN(CCC(N)=O)C(=O)CCl
InChI Key InChIKey=GOTGJGCHROYNFV-ZDUSSCGKSA-N
Data  1 IC50
  Tab Delimited (TSV)   2D SDfile   Computed 3D by Vconf -m prep SDfile
Find this compound or compounds like it in BindingDB:
Activity Spreadsheet -- Enzyme Inhibition Constant Data from BindingDB
Found 1 hit for monomerid = 525198
TargetReplicase polyprotein 1ab(2019-nCoV)
F. Hoffmann-La Roche
WIPO
LigandPNGBDBM525198(N-[(1S)-1-[[(3-Amino-3-oxo-propyl)-(2-chloroacetyl...)
Affinity DataIC50:  14nM. Assay description: For the SARS-CoV-2 3CLpro assay, 2 μL of 0.02 μM recombinant SARS-CoV-2 3CL protease were mixed with serial dilutions of each c...
Ligand InfoPC cidPC sid
In DepthDetails PubMed