BDBM525235 N-[rac-(1S)-2-[2-(3-amino-3-oxo-propyl)-2-(2-chloro-2-fluoro-acetyl)hydrazino]-1-(cyclohexylmethyl)-2-oxo-ethyl]imidazo[1,2-a]pyridine-2-carboxamide::WO2022043374, Example 82
SMILES NC(=O)CCN(NC(=O)[C@H](CC1CCCCC1)NC(=O)c1cn2ccccc2n1)C(=O)C(F)Cl
InChI Key InChIKey=NEFQFBWKDLLTNK-FUKCDUGKSA-N
Data  1 IC50
  Tab Delimited (TSV)   2D SDfile   Computed 3D by Vconf -m prep SDfile
Find this compound or compounds like it in BindingDB:
Activity Spreadsheet -- Enzyme Inhibition Constant Data from BindingDB
Found 1 hit for monomerid = 525235
TargetReplicase polyprotein 1ab(2019-nCoV)
F. Hoffmann-La Roche
WIPO
LigandPNGBDBM525235(N-[rac-(1S)-2-[2-(3-amino-3-oxo-propyl)-2-(2-chlor...)
Affinity DataIC50:  43nM. Assay description: For the SARS-CoV-2 3CLpro assay, 2 μL of 0.02 μM recombinant SARS-CoV-2 3CL protease were mixed with serial dilutions of each c...
Ligand InfoPC cidPC sid
In DepthDetails PubMed