BDBM530383 WO2022064009, Compound 160
SMILES CC(C)N1CC[C@@H]([C@H](C1)c1cccc(Cl)c1)C(=O)N1Cc2nc(NC3CCOCC3)ncc2C[C@H]1C
InChI Key InChIKey=WIMPXFDZJSGJLR-BTZRARBUSA-N
Data  2 IC50
  Tab Delimited (TSV)   2D SDfile   Computed 3D by Vconf -m prep SDfile
Find this compound or compounds like it in BindingDB:
Activity Spreadsheet -- Enzyme Inhibition Constant Data from BindingDB
Found 2 hits for monomerid = 530383
TargetCDK-activating kinase assembly factor MAT1/Cyclin-H/Cyclin-dependent kinase 7(Homo sapiens (Human))
Janssen Pharmaceutica
WIPO
LigandPNGBDBM530383(WO2022064009, Compound 160)
Affinity DataIC50:  2.63nM. Assay description: Inhibition potencies of compounds were studied using an absorbance kinetic assay as described below. Absorbance kinetic assay (5 nM CDK7/Cyclin H/MAT...
Ligand InfoPC cidPC sid
In DepthDetails PubMed
TargetCDK-activating kinase assembly factor MAT1/Cyclin-H/Cyclin-dependent kinase 7(Homo sapiens (Human))
Janssen Pharmaceutica
WIPO
LigandPNGBDBM530383(WO2022064009, Compound 160)
Affinity DataIC50:  110nM. Assay description: Inhibition potencies of compounds were studied using an absorbance kinetic assay as described below. Compounds with potencies approaching the limit o...
Ligand InfoPC cidPC sid
In DepthDetails PubMed