BDBM530537 4-[l-(2,6-Difluoro-4-methoxyphenyl)-2-[4-(difluoromethoxy)benzamido]-1H-imidazol-4-yl]-N-ethylpiperidine-l-carboxamide::WO2022076764, Example 66
SMILES CCNC(=O)N1CCC(CC1)c1cn(c(NC(=O)c2ccc(OC(F)F)cc2)n1)-c1c(F)cc(OC)cc1F
InChI Key InChIKey=ZCANMALOGSDSKJ-UHFFFAOYSA-N
Data  2 EC50
  Tab Delimited (TSV)   2D SDfile   Computed 3D by Vconf -m prep SDfile
Find this compound or compounds like it in BindingDB:
Activity Spreadsheet -- Enzyme Inhibition Constant Data from BindingDB
Found 2 hits for monomerid = 530537
TargetN-formyl peptide receptor 2(Homo sapiens (Human))
Bristol-Myers Squibb
WIPO
LigandPNGBDBM530537(4-[l-(2,6-Difluoro-4-methoxyphenyl)-2-[4-(difluoro...)
Affinity DataEC50:  540nM
Ligand InfoPC cidPC sid
In DepthDetails PubMed
TargetfMet-Leu-Phe receptor(Homo sapiens (Human))
Bristol-Myers Squibb
WIPO
LigandPNGBDBM530537(4-[l-(2,6-Difluoro-4-methoxyphenyl)-2-[4-(difluoro...)
Affinity DataEC50:  28nM
Ligand InfoPC cidPC sid
In DepthDetails PubMed