BDBM530594 WO2022076495, EXAMPLE 40
SMILES CCn1c2cc(C(=O)NC3(C)CS(=O)(=O)C3)c(F)cc2n(-c2cccc(OC(F)F)c2)c1=O
InChI Key InChIKey=MMIFPBWPQXXABI-UHFFFAOYSA-N
Data  1 IC50
  Tab Delimited (TSV)   2D SDfile   Computed 3D by Vconf -m prep SDfile
Find this compound or compounds like it in BindingDB:
Activity Spreadsheet -- Enzyme Inhibition Constant Data from BindingDB
Found 1 hit for monomerid = 530594
TargetDiacylglycerol O-acyltransferase 2(Homo sapiens (Human))
Merck Sharp &Amp
WIPO
LigandPNGBDBM530594(WO2022076495, EXAMPLE 40)
Affinity DataIC50:  194nM. Assay description: DGAT2 activity was determined by measuring the amount of enzymatic product 13Ci8-triolein (13C-l,2,3-Tri(cis-9-octadecenoyl)glycerol) using the membr...
Ligand InfoPC cidPC sid
In DepthDetails PubMed