BDBM530596 WO2022076495, EXAMPLE 42
SMILES CC1(CCS(=O)(=O)CC1)NC(=O)c1ccc2n(-c3cccc(OC(F)F)c3)c(=O)n(CCC(F)(F)F)c2c1
InChI Key InChIKey=AAKPZUBVIBRFRY-UHFFFAOYSA-N
Data  1 IC50
  Tab Delimited (TSV)   2D SDfile   Computed 3D by Vconf -m prep SDfile
Find this compound or compounds like it in BindingDB:
Activity Spreadsheet -- Enzyme Inhibition Constant Data from BindingDB
Found 1 hit for monomerid = 530596
TargetDiacylglycerol O-acyltransferase 2(Homo sapiens (Human))
Merck Sharp &Amp
WIPO
LigandPNGBDBM530596(WO2022076495, EXAMPLE 42)
Affinity DataIC50:  405nM. Assay description: DGAT2 activity was determined by measuring the amount of enzymatic product 13Ci8-triolein (13C-l,2,3-Tri(cis-9-octadecenoyl)glycerol) using the membr...
Ligand InfoPC cidPC sid
In DepthDetails PubMed