BDBM530628 WO2022076495, EXAMPLE 69a
SMILES CCOc1cc(c(F)cn1)-n1c2ccc(cc2n([C@@H](C)C(C)(C)O)c1=O)C(=O)NC1(C)CCS(=O)(=O)CC1
InChI Key InChIKey=KCFOZUYJDNYJOK-INIZCTEOSA-N
Data  1 IC50
  Tab Delimited (TSV)   2D SDfile   Computed 3D by Vconf -m prep SDfile
Find this compound or compounds like it in BindingDB:
Activity Spreadsheet -- Enzyme Inhibition Constant Data from BindingDB
Found 1 hit for monomerid = 530628
TargetDiacylglycerol O-acyltransferase 2(Homo sapiens (Human))
Merck Sharp &Amp
WIPO
LigandPNGBDBM530628(WO2022076495, EXAMPLE 69a)
Affinity DataIC50:  9.70nM. Assay description: DGAT2 activity was determined by measuring the amount of enzymatic product 13Ci8-triolein (13C-l,2,3-Tri(cis-9-octadecenoyl)glycerol) using the membr...
Ligand InfoPC cidPC sid
In DepthDetails PubMed