BDBM530706 WO2022076496, Example 6b
SMILES CC1(CS(=O)(=O)C1)NC(=O)c1ccc2N(C(=O)[C@@](C)(O)c2c1)c1cccc(OC(F)F)c1
InChI Key InChIKey=WAOHPUTWVVRDMS-NRFANRHFSA-N
Data  1 IC50
  Tab Delimited (TSV)   2D SDfile   Computed 3D by Vconf -m prep SDfile
Find this compound or compounds like it in BindingDB:
Activity Spreadsheet -- Enzyme Inhibition Constant Data from BindingDB
Found 1 hit for monomerid = 530706
TargetDiacylglycerol O-acyltransferase 2(Homo sapiens (Human))
Merck Sharp &Amp
WIPO
LigandPNGBDBM530706(WO2022076496, Example 6b)
Affinity DataIC50:  290nM
Ligand InfoPC cidPC sid
In DepthDetails PubMed