BDBM530714 WO2022076496, Example 12
SMILES CC1(C)C(=O)N(c2ccc(cc12)C(=O)N[C@H]1CCC[C@H]1O)c1cccc(OC(F)F)c1
InChI Key InChIKey=DSEIPGIZXNFQOX-PKOBYXMFSA-N
Data  1 IC50
  Tab Delimited (TSV)   2D SDfile   Computed 3D by Vconf -m prep SDfile
Find this compound or compounds like it in BindingDB:
Activity Spreadsheet -- Enzyme Inhibition Constant Data from BindingDB
Found 1 hit for monomerid = 530714
TargetDiacylglycerol O-acyltransferase 2(Homo sapiens (Human))
Merck Sharp &Amp
WIPO
LigandPNGBDBM530714(WO2022076496, Example 12)
Affinity DataIC50:  508nM
Ligand InfoPC cidPC sid
In DepthDetails PubMed