BDBM530722 WO2022076496, Example 20
SMILES C[C@]1(CCS(=O)(=O)C1)NC(=O)c1ccc2N(C(=O)C(C)(C)c2c1)c1cccc(OCC(F)F)c1
InChI Key InChIKey=MLBHXPRCMGXTKZ-XMMPIXPASA-N
Data  1 IC50
  Tab Delimited (TSV)   2D SDfile   Computed 3D by Vconf -m prep SDfile
Find this compound or compounds like it in BindingDB:
Activity Spreadsheet -- Enzyme Inhibition Constant Data from BindingDB
Found 1 hit for monomerid = 530722
TargetDiacylglycerol O-acyltransferase 2(Homo sapiens (Human))
Merck Sharp &Amp
WIPO
LigandPNGBDBM530722(WO2022076496, Example 20)
Affinity DataIC50:  12nM
Ligand InfoPC cidPC sid
In DepthDetails PubMed