BDBM530740 WO2022076496, Example 37
SMILES CC1(C)C(=O)N(c2ccc(cc12)C(=O)NC1(CS(C)(=O)=O)CCCCC1)c1cccc(OC(F)F)c1
InChI Key InChIKey=JYHWSSKJZMYHHB-UHFFFAOYSA-N
Data  1 IC50
  Tab Delimited (TSV)   2D SDfile   Computed 3D by Vconf -m prep SDfile
Find this compound or compounds like it in BindingDB:
Activity Spreadsheet -- Enzyme Inhibition Constant Data from BindingDB
Found 1 hit for monomerid = 530740
TargetDiacylglycerol O-acyltransferase 2(Homo sapiens (Human))
Merck Sharp &Amp
WIPO
LigandPNGBDBM530740(WO2022076496, Example 37)
Affinity DataIC50:  74nM
Ligand InfoPC cidPC sid
In DepthDetails PubMed