BDBM530765 WO2022076496, Example 62
SMILES CC1(C)C(=O)N(c2ccc(cc12)C(=O)NC1(C)CCS(=O)(=O)CC1)c1cc(OCC(F)F)ccn1
InChI Key InChIKey=SEFUPTZVFANYNW-UHFFFAOYSA-N
Data  1 IC50
  Tab Delimited (TSV)   2D SDfile   Computed 3D by Vconf -m prep SDfile
Find this compound or compounds like it in BindingDB:
Activity Spreadsheet -- Enzyme Inhibition Constant Data from BindingDB
Found 1 hit for monomerid = 530765
TargetDiacylglycerol O-acyltransferase 2(Homo sapiens (Human))
Merck Sharp &Amp
WIPO
LigandPNGBDBM530765(WO2022076496, Example 62)
Affinity DataIC50:  61nM
Ligand InfoPC cidPC sid
In DepthDetails PubMed