BDBM530770 WO2022076496, Example 67
SMILES CC1(C)C(=O)N(c2ccc(cc12)C(=O)NC1(C)CCS(=O)(=O)CC1)c1cc(OCC2CC2(F)F)ccn1
InChI Key InChIKey=MYWAXNNLNQSLGJ-UHFFFAOYSA-N
Data  1 IC50
  Tab Delimited (TSV)   2D SDfile   Computed 3D by Vconf -m prep SDfile
Find this compound or compounds like it in BindingDB:
Activity Spreadsheet -- Enzyme Inhibition Constant Data from BindingDB
Found 1 hit for monomerid = 530770
TargetDiacylglycerol O-acyltransferase 2(Homo sapiens (Human))
Merck Sharp &Amp
WIPO
LigandPNGBDBM530770(WO2022076496, Example 67)
Affinity DataIC50:  594nM
Ligand InfoPC cidPC sid
In DepthDetails PubMed