BDBM530798 WO2022076496, Example 95
SMILES CCOc1cc(N2C(=O)C(C)(C)c3cc(C(=O)NC4(C)CCS(=O)(=O)CC4)c(F)cc23)c(F)cn1
InChI Key InChIKey=VEICNPFJFCPBEU-UHFFFAOYSA-N
Data  1 IC50
  Tab Delimited (TSV)   2D SDfile   Computed 3D by Vconf -m prep SDfile
Find this compound or compounds like it in BindingDB:
Activity Spreadsheet -- Enzyme Inhibition Constant Data from BindingDB
Found 1 hit for monomerid = 530798
TargetDiacylglycerol O-acyltransferase 2(Homo sapiens (Human))
Merck Sharp &Amp
WIPO
LigandPNGBDBM530798(WO2022076496, Example 95)
Affinity DataIC50:  1.90nM
Ligand InfoPC cidPC sid
In DepthDetails PubMed