BDBM530844 WO2022076496, Example 135
SMILES CC1(C)C(=O)N(c2ccc(cc12)C(=O)NC1(C)CCS(=O)(=O)CC1)c1cc(OC(F)(F)F)ccc1F
InChI Key InChIKey=JEMOJSSIEOQTCL-UHFFFAOYSA-N
Data  1 IC50
  Tab Delimited (TSV)   2D SDfile   Computed 3D by Vconf -m prep SDfile
Find this compound or compounds like it in BindingDB:
Activity Spreadsheet -- Enzyme Inhibition Constant Data from BindingDB
Found 1 hit for monomerid = 530844
TargetDiacylglycerol O-acyltransferase 2(Homo sapiens (Human))
Merck Sharp &Amp
WIPO
LigandPNGBDBM530844(WO2022076496, Example 135)
Affinity DataIC50:  29nM
Ligand InfoPC cidPC sid
In DepthDetails PubMed