BDBM532062 US11208404, Compound 219
SMILES CCOc1ccc(CC)cc1C(=O)Nc1cccc(c1)-c1nnc(o1)-c1ccco1
InChI Key InChIKey=JYNHJUZATOOLSX-UHFFFAOYSA-N
Data  3 IC50
  Tab Delimited (TSV)   2D SDfile   Computed 3D by Vconf -m prep SDfile
Find this compound or compounds like it in BindingDB:
Activity Spreadsheet -- Enzyme Inhibition Constant Data from BindingDB
Found 3 hits for monomerid = 532062
TargetLysocardiolipin acyltransferase 1(Human)
Perenna Pharmaceuticals
US Patent
LigandPNGBDBM532062(US11208404, Compound 219)
Affinity DataIC50: <35nM. Assay description: ALCAT1 enzymatic activity was determined by measuring the conversion of monolysocardiolipin (MLCL) to cardiolipin or lysophosphatidylglycerol (LPG) t...
Ligand InfoPC cidPC sid
In DepthDetails US Patent
TargetLysocardiolipin acyltransferase 1(Human)
Perenna Pharmaceuticals
US Patent
LigandPNGBDBM532062(US11208404, Compound 219)
Affinity DataIC50:  34nM. Assay description: ALCAT1 enzymatic activity was determined by measuring the conversion of monolysocardiolipin (MLCL) to cardiolipin or lysophosphatidylglycerol (LPG) t...
Ligand InfoPC cidPC sid
In DepthDetails US Patent
TargetLysocardiolipin acyltransferase 1(Human)
Perenna Pharmaceuticals
US Patent
LigandPNGBDBM532062(US11208404, Compound 219)
Affinity DataIC50: <35nM. Assay description: ALCAT1 enzymatic activity was determined by measuring the conversion of monolysocardiolipin (MLCL) to cardiolipin or lysophosphatidylglycerol (LPG) t...
Ligand InfoPC cidPC sid
In DepthDetails US Patent