BDBM532094 US11208404, Compound 305
SMILES FC(F)Oc1ccc(Cl)cc1C(=O)Nc1cc(ccc1F)-c1nnc(o1)-c1ccco1
InChI Key InChIKey=RTBWRBMBDOWVET-UHFFFAOYSA-N
Data  3 IC50
  Tab Delimited (TSV)   2D SDfile   Computed 3D by Vconf -m prep SDfile
Find this compound or compounds like it in BindingDB:
Activity Spreadsheet -- Enzyme Inhibition Constant Data from BindingDB
Found 3 hits for monomerid = 532094
TargetLysocardiolipin acyltransferase 1(Human)
Perenna Pharmaceuticals
US Patent
LigandPNGBDBM532094(US11208404, Compound 305)
Affinity DataIC50: <35nM. Assay description: ALCAT1 enzymatic activity was determined by measuring the conversion of monolysocardiolipin (MLCL) to cardiolipin or lysophosphatidylglycerol (LPG) t...
Ligand InfoPC cidPC sid
In DepthDetails US Patent
TargetLysocardiolipin acyltransferase 1(Human)
Perenna Pharmaceuticals
US Patent
LigandPNGBDBM532094(US11208404, Compound 305)
Affinity DataIC50:  21nM. Assay description: ALCAT1 enzymatic activity was determined by measuring the conversion of monolysocardiolipin (MLCL) to cardiolipin or lysophosphatidylglycerol (LPG) t...
Ligand InfoPC cidPC sid
In DepthDetails US Patent
TargetLysocardiolipin acyltransferase 1(Human)
Perenna Pharmaceuticals
US Patent
LigandPNGBDBM532094(US11208404, Compound 305)
Affinity DataIC50: <35nM. Assay description: ALCAT1 enzymatic activity was determined by measuring the conversion of monolysocardiolipin (MLCL) to cardiolipin or lysophosphatidylglycerol (LPG) t...
Ligand InfoPC cidPC sid
In DepthDetails US Patent