BDBM533764 N-(4-cyanophenyl)-N-methyl-3-(4-(trifluoromethyl)phenyl)pyrazolo[1,5-a]pyridine-5-carboxamide::WO2022079616, Example 1.01
SMILES COC(=O)c1cc(ccc1Cl)N(C)C(=O)c1ccn2ncc(-c3ccc(cc3)C(N)=O)c2c1
InChI Key InChIKey=VTCHSAVXUYBAIM-UHFFFAOYSA-N
Data  2 IC50
  Tab Delimited (TSV)   2D SDfile   Computed 3D by Vconf -m prep SDfile
Find this compound or compounds like it in BindingDB:
Activity Spreadsheet -- Enzyme Inhibition Constant Data from BindingDB
Found 2 hits for monomerid = 533764
LigandPNGBDBM533764(N-(4-cyanophenyl)-N-methyl-3-(4-(trifluoromethyl)p...)
Affinity DataIC50:  550nM
Ligand InfoPC cidPC sid
In DepthDetails PubMed
TargetPhosphatidylinositol 4-kinase()
Novartis
WIPO
LigandPNGBDBM533764(N-(4-cyanophenyl)-N-methyl-3-(4-(trifluoromethyl)p...)
Affinity DataIC50: <100nM. Assay description:  Baculovirus expression and purification of C. parvum phosphatidylinositol 4-kinase: The full-length coding sequence of C. parvum PI(4)K (cgd8_4500, ...
Ligand InfoPC cidPC sid
In DepthDetails PubMed