BDBM533768 Isobutyl 5-(3-(4-carbamoylphenyl)-N-methylpyrazolo[1,5-a]pyridine-5-carboxamido)-2-chlorobenzoate::WO2022079616, Example 1.05
SMILES CC(C)COC(=O)c1cc(ccc1Cl)N(C)C(=O)c1ccn2ncc(-c3ccc(cc3)C(N)=O)c2c1
InChI Key InChIKey=QFQZCYYQFHNFRS-UHFFFAOYSA-N
Data  1 IC50
  Tab Delimited (TSV)   2D SDfile   Computed 3D by Vconf -m prep SDfile
Find this compound or compounds like it in BindingDB:
Activity Spreadsheet -- Enzyme Inhibition Constant Data from BindingDB
Found 1 hit for monomerid = 533768
TargetPhosphatidylinositol 4-kinase()
Novartis
WIPO
LigandPNGBDBM533768(Isobutyl 5-(3-(4-carbamoylphenyl)-N-methylpyrazolo...)
Affinity DataIC50: <100nM. Assay description:  Baculovirus expression and purification of C. parvum phosphatidylinositol 4-kinase: The full-length coding sequence of C. parvum PI(4)K (cgd8_4500, ...
Ligand InfoPC cidPC sid
In DepthDetails PubMed