BDBM534122 6-(Azetidin-1-yl)-N-[(5-(tert-butyl)-2-isopropoxyphenyl)sulfonyl]-4-fluorobenzofuran-2-carboxamide::WO2022081807, Example 229
SMILES CC(C)Oc1ccc(cc1S(=O)(=O)NC(=O)c1cc2c(F)cc(cc2o1)N1CCC1)C(C)(C)C
InChI Key InChIKey=KPNREYDNFNQSSR-UHFFFAOYSA-N
Data  2 IC50
  Tab Delimited (TSV)   2D SDfile   Computed 3D by Vconf -m prep SDfile
Find this compound or compounds like it in BindingDB:
Activity Spreadsheet -- Enzyme Inhibition Constant Data from BindingDB
Found 2 hits for monomerid = 534122
TargetHistone acetyltransferase KAT6B(Homo sapiens)
The Broad Institute
WIPO
LigandPNGBDBM534122(6-(Azetidin-1-yl)-N-[(5-(tert-butyl)-2-isopropoxyp...)
Affinity DataIC50:  28nM. Assay description: Kat6b inhibitory activities of the compounds described in the present invention were quantified using a Fluorescence Resonance Energy Transfer (TR-FR...
Ligand InfoPC cidPC sid
In DepthDetails PubMed
TargetHistone acetyltransferase KAT6A [507-778](Homo sapiens)
The Broad Institute
WIPO
LigandPNGBDBM534122(6-(Azetidin-1-yl)-N-[(5-(tert-butyl)-2-isopropoxyp...)
Affinity DataIC50:  4.79nM. Assay description: Kat6a inhibitory activities of the compounds described in the present invention were quantified using a Fluorescence Resonance Energy Transfer (TR-FR...
Ligand InfoPC cidPC sid
In DepthDetails PubMed