BDBM534190 N-((5-(tert-Butyl)-2-cyclobutoxyphenyl)sulfonyl)-6-cyclopropyl-4-fluorobenzofuran-2-carboxamide::WO2022081842, Example 63
SMILES CC(C)(C)c1ccc(OC2CCC2)c(c1)S(=O)(=O)NC(=O)c1cc2c(F)cc(cc2o1)C1CC1
InChI Key InChIKey=DQZUUWGKTXPTIJ-UHFFFAOYSA-N
Data  1 IC50
  Tab Delimited (TSV)   2D SDfile   Computed 3D by Vconf -m prep SDfile
Find this compound or compounds like it in BindingDB:
Activity Spreadsheet -- Enzyme Inhibition Constant Data from BindingDB
Found 1 hit for monomerid = 534190
TargetHistone acetyltransferase KAT6A [507-778](Homo sapiens)
The Broad Institute
WIPO
LigandPNGBDBM534190(N-((5-(tert-Butyl)-2-cyclobutoxyphenyl)sulfonyl)-6...)
Affinity DataIC50:  2.46nM. Assay description:  Kat6a inhibitory activities of the compounds described in the present invention were quantified using a Fluorescence Resonance Energy Transfer (TR-F...
Ligand InfoPC cidPC sid
In DepthDetails PubMed