BDBM534248 WO2022081973, Example 52
SMILES CCCCCCCCCCCCCCCCCCOC[C@H](COP(O)(=O)OC[C@H]1O[C@](C#N)([C@H](O)[C@@H]1O)c1ccc2c(N)ncnn12)Oc1cc(OC)c(cc1F)C#N
InChI Key InChIKey=DJWHZRVBNLNYTE-DEBUFGKGSA-N
Data  1 EC50
  Tab Delimited (TSV)   2D SDfile   Computed 3D by Vconf -m prep SDfile
Find this compound or compounds like it in BindingDB:
Activity Spreadsheet -- Enzyme Inhibition Constant Data from BindingDB
Found 1 hit for monomerid = 534248
TargetFusion glycoprotein F0(Human respiratory syncytial virus A (strain A2))
Gilead Sciences
WIPO
LigandPNGBDBM534248(WO2022081973, Example 52)
Affinity DataEC50:  17nM. Assay description: Antiviral activity of compounds against SARS-CoV-2 is evaluated as described in Xue, Xi et al.2020. Briefly, the human alveolar epithelial cell line ...
Ligand InfoPC cidPC sid
In DepthDetails PubMed