BDBM534410 (S)-5-(2-amino-[1,2,4]triazolo[1,5-α]pyridin-7-yl)-N-(3-(4-chlorophenyl)-3-hydroxypropyl)-2,4-dimethylbenzamide::WO2018148626, Example 146::WO2022086828, Example 146
SMILES Cc1cc(C)c(cc1C(=O)NCC[C@H](O)c1ccc(Cl)cc1)-c1ccn2nc(N)nc2c1
InChI Key InChIKey=VDFIPIOXCKVOHD-NRFANRHFSA-N
Data  5 IC50
  Tab Delimited (TSV)   2D SDfile   Computed 3D by Vconf -m prep SDfile
Find this compound or compounds like it in BindingDB:
Activity Spreadsheet -- Enzyme Inhibition Constant Data from BindingDB
Found 5 hits for monomerid = 534410
TargetMixed lineage kinase domain-like protein(Homo sapiens)
Bristol-Myers Squibb
WIPO
LigandPNGBDBM534410((S)-5-(2-amino-[1,2,4]triazolo[1,5-α]pyridin-...)
Affinity DataIC50:  0.600nM. Assay description: HT29-L23 human colorectal adenocarcinoma cells were maintained in RPMI 1640 medium containing 10% heat-inactivated FBS, 1% Penicillin-Streptomycin an...
Ligand InfoPC cidPC sid
In DepthDetails PubMed
TargetReceptor-interacting serine/threonine-protein kinase 1(Homo sapiens (Human))
Bristol-Myers Squibb
WIPO
LigandPNGBDBM534410((S)-5-(2-amino-[1,2,4]triazolo[1,5-α]pyridin-...)
Affinity DataIC50:  2.40nM. Assay description: A solution was prepared containing 0.2 nM Anti GST-Tb (Cisbio, 61GSTTLB), 90.6 nM probe and 1 nM His-GST-TVMV-hRIPKl (1-324) in FRET Buffer (20 mM HE...
Ligand InfoPC cidPC sid
In DepthDetails PubMed
TargetMixed lineage kinase domain-like protein(Homo sapiens)
Bristol-Myers Squibb
WIPO
LigandPNGBDBM534410((S)-5-(2-amino-[1,2,4]triazolo[1,5-α]pyridin-...)
Affinity DataIC50:  2.40nM. Assay description: HT29-L23 human colorectal adenocarcinoma cells were maintained in RPMI 1640 medium containing 10% heat-inactivated FBS, 1% Penicillin-Streptomycin an...
Ligand InfoPC cidPC sid
In DepthDetails PubMed
TargetReceptor-interacting serine/threonine-protein kinase 1(Homo sapiens (Human))
Bristol-Myers Squibb
WIPO
LigandPNGBDBM534410((S)-5-(2-amino-[1,2,4]triazolo[1,5-α]pyridin-...)
Affinity DataIC50:  0.600nM. Assay description: A solution was prepared containing 0.2 nM Anti GST-Tb (Cisbio, 61GSTTLB), 90.6 nM probe and 1 nM His-GST-TVMV-hRIPKl (1-324) in FRET Buffer (20 mM HE...
Ligand InfoPC cidPC sid
In DepthDetails PubMed
TargetPhosphatidylinositol 4,5-bisphosphate 3-kinase catalytic subunit delta isoform(Homo sapiens (Human))
Bristol-Myers Squibb
WIPO
LigandPNGBDBM534410((S)-5-(2-amino-[1,2,4]triazolo[1,5-α]pyridin-...)
Affinity DataIC50: >1.50E+4nM. Assay description: A solution was prepared containing 0.2 nM Anti GST-Tb (Cisbio, 61GSTTLB), 40 nM probe and 1 nM GST-tagged PIK3C5 in complex with PIK3R1 (Invitrogen #...
Ligand InfoPC cidPC sid
In DepthDetails PubMed